logged,screened,preqnr,buykit2,ifnobuy2,postqnr,logagecat,logsex,lit,pdtsort,pdtcat,pdtcat2,specpdt,pdtfor2,pdtfor,specpdtfor,prevhst,prevhstdesc,heardostb4,heardostb4desc,othertst,othertstdesc,partb4,prevtimes,prevtstdurcat2,motiv,prevtstwhere,rsnwhere,pharmno,tod,staffgender,period2,scrby2cat,deliver2,withpart,ifnopostqnr,racomment2,hstres,discl,towho,howeasy,care,rv_hst4pub,hst4pubexpl,rv_hst4pub2,rv_pharmhst,rv_pharmhst2,pharmhstexpl2,whoneedscat,whoneeds2cat,whoneedsexpl,whoneedsexpl2,adv,disadv,specdisadv,likemost,hstagain,recommend,alladdinfo
1,1,1,1,"",0,"25-35 years","Female","both swa and eng","hivtst","HST","HIV testing","kp","Self","Self","","No","","No","friend/ family member who heard about/participated in the study","Yes","pregnancy","No","2","earlier than 12 months ago","Advice from doctor or health provider/ ANC invitation","Government hospital/ clinic","I didnt choose myself, I had gone for other services",4,"Afternoon","Male staff","Before posters","ra","Over the counter",,"did not test","RA2: client did not test - said kit was taken by neighbor. client did not make time to complete the questionnaire after several calls",,,,,,"Strongly agree","BUT AM 50/50 BECAUSE IT CAN BREAK UP RELATIONSHIPS",,"Strongly agree",,"","Sex workers","","SEX WORKERS CAN BE ABLE TO TEST CLIENTS WHO DONT WANT TO USE CONDOM","","Privacy/ anonymity/ confidentiality","Absence of counsellor when testing/ increased distress after a positive result / increased possibility of self-harm or suicide/ increased possibility of harming others","",,,,"RA1: CLIENT HAD SO MUCH INTEREST IN THE STUDY AND PROMISED TO REFFER MORE FRIENDS   RA2: client did not test - said kit was taken by neighbor. client did not make time to complete the questionnaire after several calls"
1,1,0,0,"no money",,"25-35 years","Female","both swa and eng","oc","Other products","Other products","","Self","Self","",,"",,"friend/ family member who heard about/participated in the study",,"",,,,,,,4,"Afternoon","Male staff","Before posters","ra",,,"","",,,,,,,"",,,,"","","","","",,,"",,,,""
1,0,0,0,"in a hurry/ to come later",,"18-24 years","Female",,"epill","Other products","Other products","","Self","Self","",,"",,"friend/ family member who heard about/participated in the study",,"",,,,,,,4,"Afternoon","Female staff","Before posters","",,,"","",,,,,,,"",,,,"","","","","",,,"",,,,""
1,0,0,0,"in a hurry/ to come later",,">35 years","Male",,"perform","Other products","Other products","","Self","Self","",,"",,"friend/ family member who heard about/participated in the study",,"",,,,,,,4,"Night","Male staff","Before posters","",,,"","",,,,,,,"",,,,"","","","","",,,"",,,,""
1,0,0,0,"in a hurry/ to come later",,"25-35 years","Male",,"condoms","Other products","Other products","","Self","Self","",,"",,"friend/ family member who heard about/participated in the study",,"",,,,,,,4,"Night","Male staff","Before posters","",,,"","",,,,,,,"",,,,"","","","","",,,"",,,,""
1,0,0,0,"in a hurry/ to come later",,">35 years","Male",,"perform","Other products","Other products","","Self","Self","",,"",,"friend/ family member who heard about/participated in the study",,"",,,,,,,4,"Night","Male staff","Before posters","",,,"","",,,,,,,"",,,,"","","","","",,,"",,,,""
1,1,1,1,"",1,"25-35 years","Male","both swa and eng","hivtst","Other HIV test","HIV testing","","Self","Self","","No","","No","friend/ family member who heard about/participated in the study","No","","Yes","3","earlier than 12 months ago","To understand illness or symptoms that I had","VCT/ HTC center","Easily accessible",4,"Morning","Female staff","Before posters","ra","In-pharmacy test","Yes","","RA2: reported that he started ART, but declined to say where or when he enrolled in care","Pos","Yes","Sex partner","Easy","Yes","Agree","","Agree","Agree","Agree","","Everyone","The youth","CAN EASILY BE USED AND PEOPLE WILL KNOW THEIR STATUS","","Privacy/ anonymity/ confidentiality","Absence of counsellor when testing/ increased distress after a positive result / increased possibility of self-harm or suicide/ increased possibility of harming others","",,,"Likely","RA2: reported that he started ART, but declined to say where or when he enrolled in care"
1,1,1,1,"",1,"25-35 years","Female","both swa and eng","hivtst","Other HIV test","HIV testing","","Self","Self","","No","","No","friend/ family member who heard about/participated in the study","No","","Yes","3","within last 12 months","Possible exposure to HIV","VCT/ HTC center","Easily accessible",4,"Morning","Female staff","Before posters","ra","In-pharmacy test","Yes","","RA2: partner of 1018 who tested positive. referred to CPGH for PEP on day of testing.","Neg","Yes","Sex partner","Very easy",,"Agree","","Strongly agree","Agree","Strongly agree","","The youth","The youth","","more at risk of contacting the HIV virus","Personal empowerment","Absence of counsellor when testing/ increased distress after a positive result / increased possibility of self-harm or suicide/ increased possibility of harming others","","Privacy/ anonymity/ confidentiality","Yes","Very likely","RA2: partner of 1018 who tested positive. referred to CPGH for PEP on day of testing."
1,0,0,0,"in a hurry/ to come later",,"18-24 years","Female",,"epill","Other products","Other products","","Self","Self","",,"",,"friend/ family member who heard about/participated in the study",,"",,,,,,,4,"Evening","Male staff","Before posters","",,,"","",,,,,,,"",,,,"","","","","",,,"",,,,""
1,0,0,0,"declined",,"25-35 years","Female",,"condoms","Other products","Other products","","Self","Self","",,"",,"friend/ family member who heard about/participated in the study",,"",,,,,,,4,"Evening","Male staff","Before posters","",,,"","",,,,,,,"",,,,"","","","","",,,"",,,,""
1,0,0,0,"in a hurry/ to come later",,">35 years","Male",,"hivtst","Other HIV test","HIV testing","","Self","Self","",,"",,"friend/ family member who heard about/participated in the study",,"",,,,,,,4,"Afternoon","Female staff","Before posters","",,,"","",,,,,,,"",,,,"","","","","",,,"",,,,""
1,0,0,0,"in a hurry/ to come later",,"18-24 years","Female",,"pgtst","Other products","Other products","","Self","Self","",,"",,"friend/ family member who heard about/participated in the study",,"",,,,,,,4,"Morning","Female staff","Before posters","",,,"","",,,,,,,"",,,,"","","","","",,,"",,,,""
1,0,0,0,"declined",,"25-35 years","Female",,"pgtst","Other products","Other products","","Self","Self","",,"",,"friend/ family member who heard about/participated in the study",,"",,,,,,,4,"Afternoon","Female staff","Before posters","",,,"","",,,,,,,"",,,,"","","","","",,,"",,,,""
1,0,0,0,"in a hurry/ to come later",,"25-35 years","Female",,"sti","Other products","Other products","","Self","Self","",,"",,"friend/ family member who heard about/participated in the study",,"",,,,,,,4,"Morning","Female staff","Before posters","",,,"","",,,,,,,"",,,,"","","","","",,,"",,,,""
1,0,0,0,"in a hurry/ to come later",,"18-24 years","Male",,"condoms","Other products","Other products","","Self","Self","",,"",,"friend/ family member who heard about/participated in the study",,"",,,,,,,4,"Night","Male staff","Before posters","",,,"","",,,,,,,"",,,,"","","","","",,,"",,,,""
1,1,1,1,"",1,"18-24 years","Female","swa only","hivtst","HST","HIV testing","kp","Self","Self","","No","","No","friend/ family member who heard about/participated in the study","No","","Yes",">=4","within last 12 months","Encouraged by sex partner","Government hospital/ clinic","Easily accessible",4,"Afternoon","Male staff","Before posters","ra","In-pharmacy test","No","","RA2: client wanted a preliminary test prior to testing with partner  client not answering her phone thus making the follow up on confirmatory test difficult","Neg","No",,"Very easy",,"Strongly agree","","Strongly agree","Strongly agree","Strongly agree","easily accesable","Everyone","Everyone","IF THEY ARE POSITIVE THEY TAKE MEDICATION","so that they know their status","Personal empowerment","Absence of counsellor when testing/ increased distress after a positive result / increased possibility of self-harm or suicide/ increased possibility of harming others","","Privacy/ anonymity/ confidentiality","Yes","Very likely","RA2: client wanted a preliminary test prior to testing with partner  client not answering her phone thus making the follow up on confirmatory test difficult"
1,1,0,0,"in a hurry/ to come later",,"18-24 years","Female","both swa and eng","oc","Other products","Other products","","Self","Self","",,"",,"friend/ family member who heard about/participated in the study",,"",,,,,,,4,"Night","Male staff","Before posters","ra",,,"","",,,,,,,"",,,,"","","","","",,,"",,,,""
1,1,1,1,"",1,">35 years","Male","both swa and eng","hivtst","Other HIV test","HIV testing","","Self","Self","","Yes","determine","No","friend/ family member who heard about/participated in the study","No","","Yes","1","earlier than 12 months ago","To understand illness or symptoms that I had","Private hospital/ clinic (including NGO, CBO and faith-based facilities)","Easily accessible",4,"Night","Male staff","Before posters","ra","In-pharmacy test","Yes","","","Neg","Yes","Sex partner","Very easy",,"Strongly agree","","Strongly agree","Strongly agree","Strongly agree","","Married couples","Married couples","SIMPLE WAY TO TEST AT HOME","","No pricking/ painless","I dont see any disadvantage","","No pricking/ painless","Yes","Very likely",""
1,1,1,1,"",1,"25-35 years","Female","both swa and eng","hivtst","Other HIV test","HIV testing","","Self","Self","","Yes","determine","No","friend/ family member who heard about/participated in the study","Yes","pregnancy","Yes",">=4","within last 12 months","To plan the future/ getting married/ take charge over one's health","Private hospital/ clinic (including NGO, CBO and faith-based facilities)","Easily accessible",4,"Night","Male staff","Before posters","ra","In-pharmacy test","Yes","","","Neg","Yes","Sex partner","Very easy",,"Strongly agree","SO THAT PEOPLE KNOW THEIR STATUS","Strongly agree","Strongly agree","Strongly agree","","Everyone","Everyone","","","No pricking/ painless","I dont see any disadvantage","","Privacy/ anonymity/ confidentiality","Yes","Very likely",""
1,1,0,0,"in a hurry/ to come later",,">35 years","Male","both swa and eng","condoms","Other products","Other products","","Self","Self","",,"",,"friend/ family member who heard about/participated in the study",,"",,,,,,,1,"Afternoon","Male staff","Before posters","ra",,,"","",,,,,,,"",,,,"","","","","",,,"",,,,""
1,1,0,0,"in a hurry/ to come later",,"18-24 years","Female","both swa and eng","epill","Other products","Other products","","Self","Self","",,"",,"friend/ family member who heard about/participated in the study",,"",,,,,,,1,"Afternoon","Female staff","Before posters","ra",,,"","",,,,,,,"",,,,"","","","","",,,"",,,,""
1,0,0,0,"declined",,"25-35 years","Female",,"oc","Other products","Other products","","Self","Self","",,"",,"friend/ family member who heard about/participated in the study",,"",,,,,,,1,"Afternoon","Female staff","Before posters","",,,"","",,,,,,,"",,,,"","","","","",,,"",,,,""
1,1,0,0,"very sick",,"25-35 years","Male","both swa and eng","mal","Other products","Other products","","Self","Self","",,"",,"friend/ family member who heard about/participated in the study",,"",,,,,,,1,"Afternoon","Female staff","Before posters","ra",,,"","",,,,,,,"",,,,"","","","","",,,"",,,,""
1,1,1,1,"",1,"18-24 years","Female","swa only","pgtst","Other products","Other products","","Self","Self","","No","","No","friend/ family member who heard about/participated in the study","Yes","pregnancy","Yes","2","within last 12 months","Encouraged by sex partner","Government hospital/ clinic","Easily accessible",1,"Afternoon","Female staff","Before posters","ra","Over the counter","No","","","Neg","Yes","Friend","Very easy",,"Agree","","Agree","Agree","Agree","","Adults","Married couples","","","Personal empowerment","Reduced chance of disclosure / enrolment in care","","Personal empowerment","Yes","Very likely",""
1,1,1,1,"",1,"18-24 years","Male","swa only","condoms","Other products","Other products","","Self","Self","","No","","No","friend/ family member who heard about/participated in the study","No","","No",">=4","within last 12 months","Possible exposure to HIV","Private hospital/ clinic (including NGO, CBO and faith-based facilities)","Presence of skilled staff/ quality services/ information/ support",1,"Morning","Male staff","Before posters","ra","Over the counter","No","","","Neg","No",,"Very easy",,"Agree","","Strongly agree","Agree","Strongly agree","","Everyone","Everyone","","its a disease anybody can get","No pricking/ painless","Reduced chance of disclosure / enrolment in care","","Privacy/ anonymity/ confidentiality","Yes","Very likely",""
1,1,1,1,"",0,"25-35 years","Female","swa only","mal","Other products","Other products","","Self","Self","","No","","No","friend/ family member who heard about/participated in the study","Yes","pregnancy","No","3","earlier than 12 months ago","Possible exposure to HIV","Government hospital/ clinic","Easily accessible",1,"Morning","Male staff","Before posters","ra","Over the counter",,"unreachable on phone","RA2: phone switched off or out of range",,,,,,"Agree","",,"Agree",,"","Married couples","","","","Saves time / no waiting in queues","Absence of counsellor when testing/ increased distress after a positive result / increased possibility of self-harm or suicide/ increased possibility of harming others","",,,,"PRE: after testing will someone get some counseling when the results are positive?   RA1: explained that one can call the R.A incase results are positive   RA2: phone switched off or out of range"
1,1,1,0,"kits not available",,"25-35 years","Female","both swa and eng","oc","Other products","Other products","","Self","Self","","No","","No","friend/ family member who heard about/participated in the study","No","","No",">=4","within last 12 months","Encouraged by friend or family member","Private hospital/ clinic (including NGO, CBO and faith-based facilities)","Presence of skilled staff/ quality services/ information/ support",1,"Morning","Male staff","Before posters","ra",,,"","",,,,,,"Strongly agree","so that people can know their status",,"Agree",,"","Everyone","","","","No pricking/ painless","Absence of counsellor when testing/ increased distress after a positive result / increased possibility of self-harm or suicide/ increased possibility of harming others","",,,,""
1,0,0,0,"in a hurry/ to come later",,"25-35 years","Female",,"mal","Other products","Other products","","Self","Self","",,"",,"friend/ family member who heard about/participated in the study",,"",,,,,,,1,"Afternoon","Male staff","Before posters","",,,"","",,,,,,,"",,,,"","","","","",,,"",,,,""
1,0,0,0,"in a hurry/ to come later",,">35 years","Female",,"mal","Other products","Other products","","Self","Self","",,"",,"friend/ family member who heard about/participated in the study",,"",,,,,,,1,"Afternoon","Male staff","Before posters","",,,"","",,,,,,,"",,,,"","","","","",,,"",,,,""
1,1,0,0,"not ready",,"18-24 years","Female","both swa and eng","mal","Other products","Other products","","Self","Self","",,"",,"friend/ family member who heard about/participated in the study",,"",,,,,,,1,"Afternoon","Male staff","Before posters","ra",,,"","",,,,,,,"",,,,"","","","","",,,"",,,,""
1,1,0,0,"very sick",,"18-24 years","Male","both swa and eng","mal","Other products","Other products","","Self","Self","",,"",,"friend/ family member who heard about/participated in the study",,"",,,,,,,1,"Morning","Female staff","Before posters","ra",,,"","",,,,,,,"",,,,"","","","","",,,"",,,,""
1,1,1,0,"kits not available",,"25-35 years","Male","both swa and eng","hivtst","Other HIV test","HIV testing","","Self","Self","","No","","No","friend/ family member who heard about/participated in the study","No","","Yes",">=4","within last 12 months","Advice from doctor or health provider/ ANC invitation","Government hospital/ clinic","Easily accessible",1,"Morning","Male staff","Before posters","ra",,,"","",,,,,,"Agree","",,"Agree",,"","Everyone","","","","Saves time / no waiting in queues","Reduced chance of disclosure / enrolment in care","",,,,""
1,1,1,1,"",1,"25-35 years","Female","swa only","oc","Other products","Other products","","Self","Self","","No","","No","friend/ family member who heard about/participated in the study","No","","Yes","3","within last 12 months","Advice from doctor or health provider/ ANC invitation","Government hospital/ clinic","I didnt choose myself, I had gone for other services",1,"Morning","Male staff","Before posters","ra","Over the counter",,"","","Neg","Yes","Sex partner","Easy",,"Agree","","Strongly agree","Agree","Strongly agree","","Adults","Everyone","","mostly those who have reached 18years because they are people who know themselves","Saves cost/ No fare to the vct or clinic","Absence of counsellor when testing/ increased distress after a positive result / increased possibility of self-harm or suicide/ increased possibility of harming others","","Privacy/ anonymity/ confidentiality","Yes","Very likely","PRE: can i buy an extra kit for my partner?"
1,1,1,0,"kits not available",,"25-35 years","Male","swa only","condoms","Other products","Other products","","Self","Self","","No","","No","friend/ family member who heard about/participated in the study","No","","No",">=4","within last 12 months","Possible exposure to HIV","Government hospital/ clinic","Easily accessible",1,"Afternoon","Female staff","Before posters","ra",,,"","",,,,,,"Agree","",,"Agree",,"","The youth","","","","No pricking/ painless","Testing others without their consent","",,,,""
1,1,1,1,"",1,">35 years","Female","swa only","mal","Other products","Other products","","Self","Self","","No","","No","friend/ family member who heard about/participated in the study","No","","No","3","within last 12 months","Possible exposure to HIV","VCT/ HTC center","Presence of skilled staff/ quality services/ information/ support",1,"Afternoon","Female staff","Before posters","ra","Over the counter",,"","","Neg","Yes","Family member","Very easy",,"Agree","","Strongly agree","Agree","Agree","","Everyone","Other","","because they test all the time and are a risk of infection because of the syringes they use","Saves cost/ No fare to the vct or clinic","Absence of counsellor when testing/ increased distress after a positive result / increased possibility of self-harm or suicide/ increased possibility of harming others","","Privacy/ anonymity/ confidentiality","Yes","Likely","PRE: there should be an oral kit for diabetes since this HST kit is easy to use"
1,1,0,0,"in a hurry/ to come later",,"25-35 years","Male","both swa and eng","mal","Other products","Other products","","Self","Self","",,"",,"friend/ family member who heard about/participated in the study",,"",,,,,,,1,"Afternoon","Male staff","Before posters","ra",,,"","",,,,,,,"",,,,"","","","","",,,"",,,,""
1,1,1,1,"",1,"18-24 years","Female","swa only","epill","Other products","Other products","","Self","Self","","Yes","determine","Yes","friend/ family member who heard about/participated in the study","Yes","malaria","No",">=4","within last 12 months","Possible exposure to HIV","Government hospital/ clinic","Presence of skilled staff/ quality services/ information/ support",1,"Afternoon","Male staff","Before posters","ra","Over the counter","No","","","Neg","Yes","Family member","Very easy",,"Undecided","not sure how others will handle the results","Strongly agree","Agree","Strongly agree","it will be better because many people prefer phamacies than hospital","The youth","The youth","more vulnerable ti HIV due to high risk of sexual behaviour","most youths dislike visiting VCT so it will be good if they can get access to HST kits","No pricking/ painless","I dont see any disadvantage","","Privacy/ anonymity/ confidentiality","Yes","Very likely",""
1,1,0,0,"in a hurry/ to come later",,"18-24 years","Female","both swa and eng","pgtst","Other products","Other products","","Self","Self","",,"",,"friend/ family member who heard about/participated in the study",,"",,,,,,,1,"Afternoon","Female staff","Before posters","ra",,,"","",,,,,,,"",,,,"","","","","",,,"",,,,""
1,0,0,0,"declined",,"25-35 years","Male",,"epill","Other products","Other products","","Other","Partner","",,"",,"friend/ family member who heard about/participated in the study",,"",,,,,,,1,"Afternoon","Female staff","Before posters","",,,"","",,,,,,,"",,,,"","","","","",,,"",,,,""
1,1,0,0,"in a hurry/ to come later",,"25-35 years","Male","both swa and eng","epill","Other products","Other products","","Other","Partner","",,"",,"friend/ family member who heard about/participated in the study",,"",,,,,,,1,"Evening","Female staff","Before posters","ra",,,"","",,,,,,,"",,,,"","","","","",,,"",,,,""
1,1,0,0,"in a hurry/ to come later",,">35 years","Male","both swa and eng","mal","Other products","Other products","","Self","Self","",,"",,"friend/ family member who heard about/participated in the study",,"",,,,,,,1,"Afternoon","Female staff","Before posters","ra",,,"","",,,,,,,"",,,,"","","","","",,,"",,,,""
1,0,0,0,"declined",,">35 years","Male",,"epill","Other products","Other products","","Other","Partner","",,"",,"friend/ family member who heard about/participated in the study",,"",,,,,,,1,"Afternoon","Male staff","Before posters","",,,"","",,,,,,,"",,,,"","","","","",,,"",,,,""
1,1,0,0,"very sick",,"18-24 years","Male","both swa and eng","mal","Other products","Other products","","Self","Self","",,"",,"friend/ family member who heard about/participated in the study",,"",,,,,,,1,"Afternoon","Female staff","Before posters","ra",,,"","",,,,,,,"",,,,"","","","","",,,"",,,,""
1,0,0,0,"declined",,"25-35 years","Male",,"mal","Other products","Other products","","Self","Self","",,"",,"friend/ family member who heard about/participated in the study",,"",,,,,,,1,"Afternoon","Female staff","Before posters","",,,"","",,,,,,,"",,,,"","","","","",,,"",,,,""
1,1,0,0,"in a hurry/ to come later",,"18-24 years","Female","both swa and eng","mal","Other products","Other products","","Self","Self","",,"",,"friend/ family member who heard about/participated in the study",,"",,,,,,,1,"Morning","Female staff","Before posters","ra",,,"","",,,,,,,"",,,,"","","","","",,,"",,,,""
1,1,0,0,"to talk to partner first",,"18-24 years","Male","both swa and eng","epill","Other products","Other products","","Other","Partner","",,"",,"friend/ family member who heard about/participated in the study",,"",,,,,,,1,"Afternoon","Male staff","Before posters","ra",,,"","",,,,,,,"",,,,"","","","","",,,"",,,,""
1,1,0,0,"very sick",,">35 years","Female","both swa and eng","mal","Other products","Other products","","Self","Self","",,"",,"friend/ family member who heard about/participated in the study",,"",,,,,,,1,"Afternoon","Male staff","Before posters","ra",,,"","",,,,,,,"",,,,"","","","","",,,"",,,,""
1,1,0,0,"no money",,"25-35 years","Male","both swa and eng","condoms","Other products","Other products","","Self","Self","",,"",,"friend/ family member who heard about/participated in the study",,"",,,,,,,1,"Afternoon","Male staff","Before posters","ra",,,"","",,,,,,,"",,,,"","","","","",,,"",,,,""
1,1,0,0,"no money",,"18-24 years","Female","both swa and eng","mal","Other products","Other products","","Other","Family member","",,"",,"friend/ family member who heard about/participated in the study",,"",,,,,,,1,"Morning","Male staff","Before posters","ra",,,"","",,,,,,,"",,,,"","","","","",,,"",,,,""
1,0,0,0,"declined",,">35 years","Male",,"perform","Other products","Other products","","Other","Family member","",,"",,"friend/ family member who heard about/participated in the study",,"",,,,,,,2,"Afternoon","Female staff","Before posters","",,,"","",,,,,,,"",,,,"","","","","",,,"",,,,""