No,redcap_event_name,redcap_repeat_instrument,redcap_repeat_instance,doc_complete,age,iein01,iein02,iein03,iein04,iein05,iein06,iein07,iein08,ieex01,ieex02,ieex03,ieex04,ieex05,ieex06,ieex07,ieex08,ieex09,criterion_complete,randomization_complete,notification_complete,mh_yn,mhterm___ht,mhterm___dm,mhterm___hl,mhterm___id,mhterm___other,kiouyn,kiouterm___ht,kiouterm___dm,kiouterm___hl,kiouterm___id,kiouterm___other,smoke_yn,smoke_mo,alcole_mo,exercise_doctor,exercise_yn,exercise_number,exercise_minitus,sleep_time,eat_times,supplemen_bl,supplement_nm___gu,supplement_nm___com,supplement_nm___hia,supplement_nm___coll,supplement_nm___dha,supplement_nm___kya,supplement_nm___other,rastage,raclass,dm_complete,blgc_yn,blgc_nm,blgc_rsn,blmtx_yn,blmtx_rsn,blcsd_yn1,blcsd_nm1,blcsd_other_nm,blcsd_rsn,blcsd_nm2,blcsd_rsn2,blbio_yn,blbio_nm,blns_yn,cm_complete,bp_sys,bp_dia,plus,tjc,sjc,esr,crp,mmp3,rf,vas_p,vas_i,haqdi_yn,haqdi_a,haqdi_b,haqdi_c,haqdi_d,haqdi_e,haqdi_f,haqdi_g,haqdi_h,haqdi_i,haqdi_j,haqdi_k,haqdi_l,haqdi_m,haqdi_n,haqdi_o,haqdi_p,haqdi_q,haqdi_r,haqdi_s,haqdi_t,pe_complete,weight,height,abdomen,sf36_q1,sp_q2,sq_3a,sq_3b,sq_3c,sq_3d,sq_3e,sq_3f,sq_3g,sq_3h,sq_3i,sq_3j,sq_4a,sq_4b,sq_4c,sq_4d,sq_5a,sq_5b,sq_5c,sq_6,sq_7,sq_8,sq_9a,sq_9b,sq_9c,sq_9d,sq_9e,sq_9f,sq_9g,sq_9h,sq_9i,sq_10,sq_10a,sq_10b,sq_10c,sq_10d,ex_sf36_complete,us_yn,us_rl,gs_list,gs_mcp2,gs_mcp3,gs_pip2,gs_pip3,gs_mtp2,gs_mtp5,pd_list,pd_mcp2,pd_mcp3,pd_pip2,pd_pip3,pd_mtp2,pd_mtp5,us_complete,change_med___1,change_med___2,change_med___3,change_med___4,change_med___5,change_med___6,mtx_rsn,csd_nm1,csd_rsn,bio_nm,ns_yn,cm1_v3v4_complete,medcheck_nm,medcheck_rate_yn,medcontinue,medckeck_rea___1,medckeck_rea___9,medckeck_rea___2,medckeck_rea___3,medckeck_rea___4,medckeck_rea___5,medckeck_rea___6,medckeck_rea___7,medckeck_rea___8,vc_complete,aeterm,aesev,aeser,ae_complete,del_flg___1,dcc_management_form_complete,CCP,MMP3,IL17A,IL6,IL10,das28esr,das28crp,sdai,cdai,PF,RP,BP,GH,VT,SF,RE,MH,mHAQ,gs,pd
1001,visit1_arm_1,,,0,69,1,1,1,1,1,1,1,1,0,0,0,0,0,0,0,0,0,2,2,0,,,,,,,,,,,,,,,,,,,,,,,,,,,,,,,,,,,,,,,,,,,,,,,,,,,,,,,,,,,,,,,,,,,,,,,,,,,,,,,,,,,,,,,,,,,,,,,,,,,,,,,,,,,,,,,,,,,,,,,,,,,,,,,,,,,,,,,,,,,,,,,,,,,,,,,,,,,,,,,,,,,,,,,0,0,,,,,,,,,,,,,,,,,,,,
1001,visit2_arm_1,,,,,,,,,,,,,,,,,,,,,,,,,1,1,0,0,0,1,1,1,0,0,0,0,0,,3,0,0,,,6,2,0,0,0,0,0,0,0,0,3,1,2,0,,,1,16,0,,,,,,0,,1,2,159,95,104,4,1,56,1.11,,256,47,8,1,0,0,0,0,0,0,2,0,0,0,0,0,1,0,0,2,0,0,0,0,2,53.9,149.3,92,4,4,1,2,2,2,2,3,2,3,3,3,3,3,3,3,3,3,3,3,4,3,3,3,4,4,4,3,3,3,2,3,1,5,1,5,2,1,0,1,0,0,0,0,0,2,1,0,0,0,0,0,1,2,,,,,,,,,,,,,,,,,,,,,,,,,,,,,,,,1200,175.2,1.36,9.73,0.287,4.875746184,3.915553963,61.11,60,65,50,41,5,37.5,50,50,50,0.25,3,2
1001,visit3_arm_1,,,,,,,,,,,,,,,,,,,,,,,,,,,,,,,,,,,,,,,,,,,,,,,,,,,,,,,,,,,,,,,,,,,,,,,,140,79,79,3,0,50,0.26,,276,45,8,1,1,0,0,0,0,0,1,0,0,0,0,0,0,0,0,1,0,0,0,1,2,,,,,,,,,,,,,,,,,,,,,,,,,,,,,,,,,,,,,,,,,1,0,1,0,0,0,0,1,2,1,0,0,0,0,0,3,2,1,0,0,0,0,0,,,,,,2,45,2,1,0,0,0,0,0,0,0,0,0,2,,,,,,,,,,,,4.338364556,3.021084637,56.26,56,,,,,,,,,0.2,4,4
1001,visit4_arm_1,,,,,,,,,,,,,,,,,,,,,,,,,,,,,,,,,,,,,,,,,,,,,,,,,,,,,,,,,,,,,,,,,,,,,,,,124,77,82,1,2,45,0.16,,326,51,5,1,0,0,0,0,0,0,1,0,0,0,0,0,1,0,0,1,0,0,0,0,2,55.1,149.2,96.6,3,3,1,2,2,2,2,3,3,3,3,3,4,3,3,4,4,4,4,2,3,2,3,4,5,3,4,4,4,3,3,3,1,3,3,4,2,1,0,2,0,0,0,0,0,0,1,0,0,0,0,0,0,2,1,0,0,0,0,0,,,,,,2,40,2,1,0,0,0,0,0,0,0,0,0,2,,,,,,,1200,182.1,2,22.6,0.543,4.33464354,2.973963918,59.16,59,70,62.5,62,37,50,62.5,75,70,0.15,2,1
1001,visit5_arm_1,,,,,,,,,,,,,,,,,,,,,,,,,,,,,,,,,,,,,,,,,,,,,,,,,,,,,,,,,,,,,,,,,,,,,,,,155,89,92,4,0,44,0.34,,289,50,16,1,1,0,0,0,0,0,2,0,0,0,0,0,1,0,0,2,0,0,0,0,2,,,,,,,,,,,,,,,,,,,,,,,,,,,,,,,,,,,,,,,,,1,0,2,0,0,0,0,1,1,1,0,0,0,0,1,1,2,1,0,0,0,0,0,,,,,,2,,,1,0,0,0,0,0,0,0,0,0,2,,,,,,,,,,,,4.468932744,3.313377635,70.34,70,,,,,,,,,0.3,4,3
1002,visit1_arm_1,,,0,60,1,1,1,1,1,1,1,1,0,0,0,0,0,0,0,0,0,2,2,0,,,,,,,,,,,,,,,,,,,,,,,,,,,,,,,,,,,,,,,,,,,,,,,,,,,,,,,,,,,,,,,,,,,,,,,,,,,,,,,,,,,,,,,,,,,,,,,,,,,,,,,,,,,,,,,,,,,,,,,,,,,,,,,,,,,,,,,,,,,,,,,,,,,,,,,,,,,,,,,,,,,,,,,0,0,,,,,,,,,,,,,,,,,,,,
1002,visit2_arm_1,,,,,,,,,,,,,,,,,,,,,,,,,1,1,0,0,0,0,1,0,0,0,0,1,1,3,3,0,1,7,30,6,3,1,0,0,0,0,0,0,1,3,1,2,0,,,1,12,1,1,,1000,,,0,,1,2,145,97,60,17,0,12,0.2,,139,65,8,1,0,0,0,0,0,0,0,0,0,0,0,0,0,0,0,0,0,0,0,1,2,69.1,155,96,3,3,2,3,3,3,3,2,2,3,3,3,4,4,4,4,5,5,5,1,3,3,2,4,5,2,2,4,4,2,2,5,2,3,4,5,2,1,1,0,0,0,0,0,1,0,0,0,0,0,0,0,0,2,,,,,,,,,,,,,,,,,,,,,,,,,,,,,,,,92.8,25.6,0.0523,0.43,0.46,4.958373805,4.574439574,90.2,90,85,75,52,42,62.5,100,100,80,0.05,1,0
1002,visit3_arm_1,,,,,,,,,,,,,,,,,,,,,,,,,,,,,,,,,,,,,,,,,,,,,,,,,,,,,,,,,,,,,,,,,,,,,,,,139,93,69,9,0,10,0.32,,153,38,3,1,0,0,0,0,0,0,0,0,0,0,0,0,0,0,0,0,0,0,0,1,2,,,,,,,,,,,,,,,,,,,,,,,,,,,,,,,,,,,,,,,,,1,1,0,0,0,0,0,0,0,0,0,0,0,0,0,0,2,1,0,0,0,0,0,,,,,,2,50,2,1,0,0,0,0,0,0,0,0,0,2,,,,,,,,,,,,3.823809565,3.688630429,50.32,50,,,,,,,,,0.05,0,0
1002,visit4_arm_1,,,,,,,,,,,,,,,,,,,,,,,,,,,,,,,,,,,,,,,,,,,,,,,,,,,,,,,,,,,,,,,,,,,,,,,,170,111,78,4,0,14,0.25,,154,66,2,1,0,0,0,1,0,0,0,0,0,0,1,0,1,0,0,0,0,0,0,1,2,73,155.6,96.5,3,2,1,2,1,2,3,1,3,3,3,2,4,4,4,4,5,5,5,1,6,4,2,5,5,2,2,5,4,2,3,5,4,4,5,3,2,1,1,1,0,0,0,0,0,0,1,0,0,0,0,0,0,2,1,0,0,0,0,0,,,,,,2,15,2,1,0,0,0,0,0,0,0,0,0,2,,,,,,,103,26.5,0.02,0.636,0.452,3.891340131,3.454994669,72.25,72,55,75,10,62,68.75,100,100,90,0.2,1,1
1002,visit5_arm_1,,,,,,,,,,,,,,,,,,,,,,,,,,,,,,,,,,,,,,,,,,,,,,,,,,,,,,,,,,,,,,,,,,,,,,,,148,95,73,3,0,18,0.22,,161,89,10,1,0,1,0,1,1,0,1,0,0,1,1,0,3,0,1,0,0,0,0,1,2,,,,,,,,,,,,,,,,,,,,,,,,,,,,,,,,,,,,,,,,,1,1,0,0,0,0,0,0,0,0,0,0,0,0,0,0,2,1,0,0,0,0,0,,,,,,2,,,1,0,0,0,0,0,0,0,0,0,2,,,,,,,,,,,,4.239208683,3.594682744,102.22,102,,,,,,,,,0.55,0,0
1003,visit1_arm_1,,,0,56,1,1,1,1,1,1,1,1,0,0,0,0,0,0,0,0,0,2,2,0,,,,,,,,,,,,,,,,,,,,,,,,,,,,,,,,,,,,,,,,,,,,,,,,,,,,,,,,,,,,,,,,,,,,,,,,,,,,,,,,,,,,,,,,,,,,,,,,,,,,,,,,,,,,,,,,,,,,,,,,,,,,,,,,,,,,,,,,,,,,,,,,,,,,,,,,,,,,,,,,,,,,,,,0,0,,,,,,,,,,,,,,,,,,,,
1003,visit2_arm_1,,,,,,,,,,,,,,,,,,,,,,,,,0,0,0,0,0,0,0,0,0,0,0,0,1,3,3,0,0,,,6,3,1,0,0,0,0,0,0,1,1,1,2,0,,,1,10,1,1,,1500,3,1,0,,0,2,141,84,70,3,3,16,0.04,,87,20,10,1,0,0,0,0,0,0,0,0,0,0,0,0,0,0,0,0,0,0,0,0,2,51.3,160.8,77,3,3,2,3,3,3,3,3,3,3,3,3,4,5,5,5,5,5,5,1,4,3,3,5,5,2,3,5,5,3,4,5,3,3,3,3,2,1,0,2,3,0,0,1,0,0,2,3,0,0,1,0,0,2,,,,,,,,,,,,,,,,,,,,,,,,,,,,,,,,494,70.1,0.02,2.5,0.619,3.675734784,2.816052684,36.04,36,95,93.75,41,52,68.75,100,100,85,0,6,6
1003,visit3_arm_1,,,,,,,,,,,,,,,,,,,,,,,,,,,,,,,,,,,,,,,,,,,,,,,,,,,,,,,,,,,,,,,,,,,,,,,,129,77,76,0,2,17,0.13,,69,3,11,1,0,0,0,0,0,0,0,0,0,0,0,0,0,0,0,0,0,0,0,0,2,,,,,,,,,,,,,,,,,,,,,,,,,,,,,,,,,,,,,,,,,1,0,1,3,0,0,0,0,0,1,3,0,0,0,0,0,2,1,0,0,0,0,0,,,,,,2,35,2,1,0,0,0,0,0,0,0,0,0,2,,,,,,,,,,,,2.421229138,1.697827082,16.13,16,,,,,,,,,0,4,4
1003,visit4_arm_1,,,,,,,,,,,,,,,,,,,,,,,,,,,,,,,,,,,,,,,,,,,,,,,,,,,,,,,,,,,,,,,,,,,,,,,,122,81,69,3,3,16,0.11,,66,22,8,1,0,0,0,0,0,0,0,0,0,0,0,0,0,0,0,0,0,0,0,0,2,54.2,160.2,80,3,2,2,3,3,3,3,3,3,3,3,3,5,5,5,5,5,5,5,1,3,2,3,4,5,3,3,5,5,2,4,5,3,3,4,3,2,1,0,2,3,0,0,0,0,0,2,3,0,0,0,0,0,2,1,0,0,0,0,0,,,,,,2,30,2,1,0,0,0,0,0,0,0,0,0,2,,,,,,,445,93.4,0.02,5.34,0.601,3.703734784,2.990020122,36.11,36,95,100,62,57,68.75,100,100,80,0,5,5
1003,visit5_arm_1,,,,,,,,,,,,,,,,,,,,,,,,,,,,,,,,,,,,,,,,,,,,,,,,,,,,,,,,,,,,,,,,,,,,,,,,137,83,92,1,0,11,0.13,,52,7,2,1,0,0,0,0,0,0,0,0,0,0,0,0,0,0,0,0,0,0,0,0,2,,,,,,,,,,,,,,,,,,,,,,,,,,,,,,,,,,,,,,,,,1,0,2,3,0,0,0,0,0,2,3,0,0,0,0,0,2,1,0,0,0,0,0,,,,,,2,,,1,0,0,0,0,0,0,0,0,0,2,,,,,,,,,,,,2.336526691,1.917847284,10.13,10,,,,,,,,,0,5,5
1004,visit1_arm_1,,,0,53,1,1,1,1,1,1,1,1,0,0,0,0,0,0,0,0,0,2,2,0,,,,,,,,,,,,,,,,,,,,,,,,,,,,,,,,,,,,,,,,,,,,,,,,,,,,,,,,,,,,,,,,,,,,,,,,,,,,,,,,,,,,,,,,,,,,,,,,,,,,,,,,,,,,,,,,,,,,,,,,,,,,,,,,,,,,,,,,,,,,,,,,,,,,,,,,,,,,,,,,,,,,,,,0,0,,,,,,,,,,,,,,,,,,,,
1004,visit2_arm_1,,,,,,,,,,,,,,,,,,,,,,,,,0,0,0,0,0,0,1,0,0,0,1,1,0,,2,0,0,,,6,3,0,0,0,0,0,0,0,0,4,2,2,0,,,1,10,1,3,,2,,,1,1,0,2,110,71,75,1,4,25,0.35,,16,40,9,1,0,0,0,0,1,0,1,0,0,1,0,0,0,0,1,0,0,0,0,0,2,51.1,157.6,78,4,3,1,3,1,3,3,3,3,3,3,3,5,5,5,3,5,5,4,3,4,2,4,4,5,3,3,4,4,3,2,3,1,4,2,5,2,1,0,0,0,1,0,0,0,0,0,0,0,0,0,0,0,2,,,,,,,,,,,,,,,,,,,,,,,,,,,,,,,,35.7,67.6,1.71,1.9,2.04,3.933213077,3.181467863,54.35,54,80,87.5,51,15,43.75,50,91.66666667,70,0.2,1,0
1004,visit3_arm_1,,,,,,,,,,,,,,,,,,,,,,,,,,,,,,,,,,,,,,,,,,,,,,,,,,,,,,,,,,,,,,,,,,,,,,,,113,64,78,1,4,13,0.08,,11,21,4,1,0,0,0,0,1,0,0,0,0,1,0,0,0,0,0,0,0,0,0,0,2,,,,,,,,,,,,,,,,,,,,,,,,,,,,,,,,,,,,,,,,,1,0,0,0,0,0,0,0,0,0,0,0,0,0,0,0,2,1,0,0,0,0,0,,,,,,2,0,2,1,0,0,0,0,0,0,0,0,0,2,,,,,,,,,,,,3.20946455,2.585603199,30.08,30,,,,,,,,,0.1,0,0
1004,visit4_arm_1,,,,,,,,,,,,,,,,,,,,,,,,,,,,,,,,,,,,,,,,,,,,,,,,,,,,,,,,,,,,,,,,,,,,,,,,143,81,75,2,5,9,0.03,,9,43,39,1,0,0,0,0,1,0,1,0,0,1,0,0,0,0,1,1,0,0,0,0,2,53.5,157.1,86,4,3,1,3,2,3,3,2,3,3,3,3,5,5,5,5,5,5,5,3,3,2,4,4,5,3,4,5,4,3,3,3,1,4,1,4,2,1,0,1,0,0,0,0,0,0,0,0,0,0,0,0,0,2,0,0,0,0,1,0,,,,10,,2,30,2,1,0,0,0,0,0,0,0,0,0,2,,,,,,,22.6,89.4,2.74,1.04,0.16,3.558115833,3.074509764,89.03,89,80,100,62,15,43.75,50,100,75,0.25,1,0
1004,visit5_arm_1,,,,,,,,,,,,,,,,,,,,,,,,,,,,,,,,,,,,,,,,,,,,,,,,,,,,,,,,,,,,,,,,,,,,,,,,122,70,76,2,0,12,0.02,,5,29,4,1,0,0,0,0,1,0,1,0,0,1,0,0,0,0,1,0,0,0,0,0,2,,,,,,,,,,,,,,,,,,,,,,,,,,,,,,,,,,,,,,,,,1,0,1,0,0,0,0,0,0,1,0,0,0,0,0,0,2,1,0,0,0,0,0,,,,,,2,,,1,0,0,0,0,0,0,0,0,0,2,,,,,,,,,,,,2.93739425,2.223595355,35.02,35,,,,,,,,,0.2,1,1
1005,visit1_arm_1,,,0,63,1,1,1,1,1,1,1,1,0,0,0,0,0,0,0,0,0,2,2,0,,,,,,,,,,,,,,,,,,,,,,,,,,,,,,,,,,,,,,,,,,,,,,,,,,,,,,,,,,,,,,,,,,,,,,,,,,,,,,,,,,,,,,,,,,,,,,,,,,,,,,,,,,,,,,,,,,,,,,,,,,,,,,,,,,,,,,,,,,,,,,,,,,,,,,,,,,,,,,,,,,,,,,,0,0,,,,,,,,,,,,,,,,,,,,
1005,visit2_arm_1,,,,,,,,,,,,,,,,,,,,,,,,,1,0,0,0,1,0,1,0,0,1,0,0,0,,3,0,0,,,7,3,1,0,0,0,0,1,0,0,4,1,2,0,,,1,17.5,1,1,,1500mg,,,0,,1,2,130,76,91,1,4,34,0.04,,145,1,7,1,0,0,0,0,0,0,0,0,0,0,0,0,0,0,0,0,0,0,0,0,2,44.1,151.9,71,3,1,2,2,3,3,3,2,2,3,3,3,3,4,4,4,5,5,5,3,2,1,2,4,4,2,3,4,4,3,3,5,3,3,2,3,2,1,0,3,3,0,0,0,0,1,1,2,0,0,0,0,0,2,,,,,,,,,,,,,,,,,,,,,,,,,,,,,,,,1180,118.3,2.47,1.88,0.595,3.602452367,2.215130005,13.04,13,80,68.75,84,47,62.5,75,100,70,0,7,3
1005,visit3_arm_1,,,,,,,,,,,,,,,,,,,,,,,,,,,,,,,,,,,,,,,,,,,,,,,,,,,,,,,,,,,,,,,,,,,,,,,,120,74,95,0,1,46,0.06,,183,1,10,1,0,0,0,0,0,0,0,0,0,0,0,0,0,0,0,0,0,0,0,0,2,,,,,,,,,,,,,,,,,,,,,,,,,,,,,,,,,,,,,,,,,1,0,3,3,0,3,1,1,0,2,3,0,2,1,0,0,2,1,0,0,0,0,0,,,,,,2,0,2,1,0,0,0,0,0,0,0,0,0,2,,,,,,,,,,,,2.974048978,1.423201307,12.06,12,,,,,,,,,0,11,8
1005,visit4_arm_1,,,,,,,,,,,,,,,,,,,,,,,,,,,,,,,,,,,,,,,,,,,,,,,,,,,,,,,,,,,,,,,,,,,,,,,,142,89,119,3,3,49,0.11,,189,2,5,1,0,0,0,0,0,0,0,0,0,0,0,0,0,0,0,0,0,0,0,0,2,46.5,151.9,74,3,1,2,2,2,2,2,2,2,2,2,3,4,4,4,5,5,5,5,4,4,3,3,3,3,3,3,3,4,3,4,3,3,3,3,3,2,1,0,3,3,0,3,3,1,0,2,3,0,3,3,0,0,2,1,0,0,0,0,0,,,,,,2,20,2,1,0,0,0,0,0,0,0,0,0,2,,,,,,,1160,127.6,2.79,3.58,4.02,4.207196887,2.710020122,13.11,13,55,81.25,41,52,62.5,37.5,100,50,0,13,11
1005,visit5_arm_1,,,,,,,,,,,,,,,,,,,,,,,,,,,,,,,,,,,,,,,,,,,,,,,,,,,,,,,,,,,,,,,,,,,,,,,,142,82,106,0,0,53,0.24,,344,4,6,1,0,0,1,1,0,0,0,0,1,0,1,1,0,0,0,0,0,0,0,1,2,,,,,,,,,,,,,,,,,,,,,,,,,,,,,,,,,,,,,,,,,1,0,3,3,0,1,3,0,0,1,1,0,1,1,0,0,2,1,0,0,0,0,0,,,,,,2,,,1,0,0,0,0,0,0,0,0,0,2,,,,,,,,,,,,2.835204339,1.456559155,10.24,10,,,,,,,,,0.3,10,4
1006,visit1_arm_1,,,0,61,1,1,1,1,1,1,1,1,0,0,0,0,0,0,0,0,0,2,2,0,,,,,,,,,,,,,,,,,,,,,,,,,,,,,,,,,,,,,,,,,,,,,,,,,,,,,,,,,,,,,,,,,,,,,,,,,,,,,,,,,,,,,,,,,,,,,,,,,,,,,,,,,,,,,,,,,,,,,,,,,,,,,,,,,,,,,,,,,,,,,,,,,,,,,,,,,,,,,,,,,,,,,,,0,0,,,,,,,,,,,,,,,,,,,,
1006,visit2_arm_1,,,,,,,,,,,,,,,,,,,,,,,,,0,0,0,0,0,0,0,0,0,0,0,0,0,,2,0,0,,,7,2,0,0,0,0,0,0,0,0,4,3,2,0,,,1,10,0,,,,,,0,,1,2,137,75,85,0,0,26,0.2,,40,71,4,1,3,2,1,1,3,3,2,1,1,3,3,2,3,1,1,2,2,1,2,3,2,54.8,155.1,78.5,2,3,1,1,1,2,2,1,1,2,2,1,1,1,2,2,5,5,5,1,3,2,1,5,5,1,2,5,4,1,3,5,5,1,5,1,2,1,0,1,0,0,0,0,0,0,0,0,0,0,0,0,0,2,,,,,,,,,,,,,,,,,,,,,,,,,,,,,,,,35.7,31.7,1.71,3.1,1.52,3.274667577,2.349500424,75.2,75,20,12.5,62,97,75,100,100,100,2,1,0
1006,visit3_arm_1,,,,,,,,,,,,,,,,,,,,,,,,,,,,,,,,,,,,,,,,,,,,,,,,,,,,,,,,,,,,,,,,,,,,,,,,142,85,102,0,0,17,0.12,,42,48,3,1,3,2,2,1,3,3,3,1,1,3,3,2,3,2,2,3,3,2,2,2,2,,,,,,,,,,,,,,,,,,,,,,,,,,,,,,,,,,,,,,,,,1,0,1,0,0,0,0,0,0,1,0,0,0,0,0,0,2,1,0,0,0,0,0,,,,,,2,65,2,1,0,0,0,0,0,0,0,0,0,2,,,,,,,,,,,,2.655249341,1.91584465,51.12,51,,,,,,,,,2.3,1,1
1006,visit4_arm_1,,,,,,,,,,,,,,,,,,,,,,,,,,,,,,,,,,,,,,,,,,,,,,,,,,,,,,,,,,,,,,,,,,,,,,,,137,82,103,0,0,14,0.11,,37,78,3,1,3,2,2,2,3,3,3,1,1,3,3,2,3,2,2,3,3,2,2,3,2,57.1,157.8,84.5,2,3,1,1,1,1,2,1,1,1,2,1,5,5,5,5,5,5,5,1,3,2,2,5,5,1,3,5,5,1,5,5,5,1,1,1,2,1,0,1,0,0,0,0,0,0,1,0,0,0,0,0,0,2,1,0,0,0,0,0,,,,,,2,5,2,1,0,0,0,0,0,0,0,0,0,2,,,,,,,28.7,45.3,0.02,0.948,0.18,2.939340131,2.319097444,81.11,81,10,100,62,77,81.25,100,100,100,2.4,1,1
1006,visit5_arm_1,,,,,,,,,,,,,,,,,,,,,,,,,,,,,,,,,,,,,,,,,,,,,,,,,,,,,,,,,,,,,,,,,,,,,,,,134,78,85,0,0,22,0.08,,40,61,4,1,3,2,2,2,3,3,3,1,1,3,3,2,3,2,2,3,3,2,2,3,2,,,,,,,,,,,,,,,,,,,,,,,,,,,,,,,,,,,,,,,,,1,0,1,0,0,0,0,0,0,0,0,0,0,0,0,0,2,1,0,0,0,0,0,,,,,,2,,,1,0,0,0,0,0,0,0,0,0,2,,,,,,,,,,,,3.017729717,2.025603199,65.08,65,,,,,,,,,2.4,1,0
1007,visit1_arm_1,,,0,51,1,1,1,1,1,1,1,1,0,0,0,0,0,0,0,0,0,2,2,0,,,,,,,,,,,,,,,,,,,,,,,,,,,,,,,,,,,,,,,,,,,,,,,,,,,,,,,,,,,,,,,,,,,,,,,,,,,,,,,,,,,,,,,,,,,,,,,,,,,,,,,,,,,,,,,,,,,,,,,,,,,,,,,,,,,,,,,,,,,,,,,,,,,,,,,,,,,,,,,,,,,,,,,0,0,,,,,,,,,,,,,,,,,,,,
1007,visit2_arm_1,,,,,,,,,,,,,,,,,,,,,,,,,1,0,0,0,1,0,0,0,0,0,0,0,0,,2,0,0,,,6,3,0,0,0,0,0,0,0,0,3,1,2,0,,,1,15,1,1,,1000,,,0,,1,2,134,84,91,1,1,39,0.35,,59,14,6,1,0,0,0,0,0,0,0,0,0,0,0,0,0,0,0,0,0,0,0,0,2,53.9,164.4,69.4,3,3,1,3,3,3,3,2,3,3,3,3,5,4,5,5,5,5,5,2,3,2,2,3,4,3,5,3,3,3,2,4,3,3,3,3,2,1,1,1,0,0,2,0,0,0,0,0,0,1,0,0,0,2,,,,,,,,,,,,,,,,,,,,,,,,,,,,,,,,8.7,51.4,0.02,4.01,1.21,3.600493152,2.537467863,22.35,22,85,93.75,62,52,37.5,75,100,55,0,3,1
1007,visit3_arm_1,,,,,,,,,,,,,,,,,,,,,,,,,,,,,,,,,,,,,,,,,,,,,,,,,,,,,,,,,,,,,,,,,,,,,,,,120,78,87,1,3,45,0.21,,67,18,21,1,0,0,0,0,0,0,0,0,0,0,0,0,0,0,0,0,0,0,0,0,2,,,,,,,,,,,,,,,,,,,,,,,,,,,,,,,,,,,,,,,,,1,1,1,0,0,0,0,0,0,0,0,0,0,0,0,0,2,1,0,0,0,0,0,,,,,,2,70,2,1,0,0,0,0,0,0,0,0,0,2,,,,,,,,,,,,3.961637969,2.664278986,43.21,43,,,,,,,,,0,1,0
1007,visit4_arm_1,,,,,,,,,,,,,,,,,,,,,,,,,,,,,,,,,,,,,,,,,,,,,,,,,,,,,,,,,,,,,,,,,,,,,,,,122,80,87,1,0,43,0.84,,67,13,4,1,0,0,0,0,0,0,0,0,0,0,0,0,0,0,0,0,0,0,0,0,2,54.7,164.2,72.5,3,3,2,3,3,3,3,2,3,3,3,3,4,4,5,5,5,5,5,2,5,2,3,4,5,3,3,4,2,2,2,5,4,3,3,3,2,1,1,1,0,0,0,0,1,0,1,0,0,0,0,0,0,2,1,0,0,0,0,0,,,,,,2,95,2,1,0,0,0,0,0,0,0,0,0,2,,,,,,,7.8,51.8,0.02,4.33,0.302,3.374840081,2.508655488,18.84,18,90,87.5,42,57,37.5,87.5,100,75,0,2,1
1007,visit5_arm_1,,,,,,,,,,,,,,,,,,,,,,,,,,,,,,,,,,,,,,,,,,,,,,,,,,,,,,,,,,,,,,,,,,,,,,,,117,68,83,5,2,42,0.7,,63,19,31,1,0,0,0,0,0,0,0,0,0,0,0,0,0,0,0,0,0,0,0,0,2,,,,,,,,,,,,,,,,,,,,,,,,,,,,,,,,,,,,,,,,,1,1,1,3,0,0,0,0,0,1,2,0,0,0,0,0,2,1,0,0,0,0,0,,,,,,2,,,1,0,0,0,0,0,0,0,0,0,2,,,,,,,,,,,,4.530546598,3.62277682,57.7,57,,,,,,,,,0,4,3
1008,visit1_arm_1,,,0,44,1,1,1,1,1,1,1,1,0,0,0,0,0,0,0,0,0,2,2,0,,,,,,,,,,,,,,,,,,,,,,,,,,,,,,,,,,,,,,,,,,,,,,,,,,,,,,,,,,,,,,,,,,,,,,,,,,,,,,,,,,,,,,,,,,,,,,,,,,,,,,,,,,,,,,,,,,,,,,,,,,,,,,,,,,,,,,,,,,,,,,,,,,,,,,,,,,,,,,,,,,,,,,,0,0,,,,,,,,,,,,,,,,,,,,
1008,visit2_arm_1,,,,,,,,,,,,,,,,,,,,,,,,,1,0,0,0,1,0,0,0,0,0,0,0,0,,3,0,0,,,6,2,0,0,0,0,0,0,0,0,3,1,2,0,,,1,16,0,,,,,,1,2,1,2,111,70,73,4,5,6,0.03,,17,30,6,1,0,0,0,0,0,0,0,1,0,0,0,0,0,0,0,0,0,0,0,0,2,,,89,3,3,1,2,2,3,3,3,2,3,3,3,4,5,4,5,5,5,5,1,4,2,2,3,4,3,3,4,4,3,4,5,3,3,3,3,2,1,0,0,1,0,0,0,0,0,0,0,0,0,0,0,0,2,,,,,,,,,,,,,,,,,,,,,,,,,,,,,,,,45.4,44.3,2.53,0.116,1.75,3.420330662,3.220550169,45.03,45,75,87.5,51,52,68.75,100,100,60,0.05,1,0
1008,visit3_arm_1,,,,,,,,,,,,,,,,,,,,,,,,,,,,,,,,,,,,,,,,,,,,,,,,,,,,,,,,,,,,,,,,,,,,,,,,128,81,81,7,3,9,0.03,,28,26,5,1,0,0,0,0,0,0,0,1,0,0,0,0,0,0,0,0,0,0,0,0,2,,,,,,,,,,,,,,,,,,,,,,,,,,,,,,,,,,,,,,,,,1,0,0,0,1,0,0,0,0,0,0,0,0,0,0,0,2,1,0,0,0,0,0,,,,,,2,5,2,1,0,0,0,0,0,0,0,0,0,2,,,,,,,,,,,,3.868652164,3.385046096,41.03,41,,,,,,,,,0.05,1,0
1008,visit4_arm_1,,,,,,,,,,,,,,,,,,,,,,,,,,,,,,,,,,,,,,,,,,,,,,,,,,,,,,,,,,,,,,,,,,,,,,,,129,86,93,5,2,10,0.02,,22,31,10,1,0,0,0,0,0,0,0,1,0,0,0,0,0,0,0,0,0,0,0,0,2,59.4,168,75,3,3,1,2,1,3,3,3,2,3,3,3,3,3,4,3,4,4,4,2,4,3,2,1,4,2,3,3,4,3,3,4,3,3,3,3,2,1,0,1,0,0,0,0,1,0,1,0,0,0,0,1,0,2,1,0,0,0,0,0,,,,,,2,35,2,1,0,0,0,0,0,0,0,0,0,2,,,,,,,70.2,59.2,1.92,0.458,0.216,3.69398743,3.107813625,48.02,48,70,56.25,41,52,62.5,75,75,50,0.05,2,2
1008,visit5_arm_1,,,,,,,,,,,,,,,,,,,,,,,,,,,,,,,,,,,,,,,,,,,,,,,,,,,,,,,,,,,,,,,,,,,,,,,,105,60,81,4,5,13,0.01,,25,26,4,1,0,0,0,0,0,0,0,1,0,0,0,0,0,0,0,0,0,0,0,0,2,,,,,,,,,,,,,,,,,,,,,,,,,,,,,,,,,,,,,,,,,1,0,0,0,0,0,0,1,0,0,0,0,0,0,0,0,2,1,0,0,0,0,0,,,,,,2,,,1,0,0,0,0,0,0,0,0,0,2,,,,,,,,,,,,3.905563584,3.104410698,39.01,39,,,,,,,,,0.05,1,0
1008,ae_arm_1,ae,1,,,,,,,,,,,,,,,,,,,,,,,,,,,,,,,,,,,,,,,,,,,,,,,,,,,,,,,,,,,,,,,,,,,,,,,,,,,,,,,,,,,,,,,,,,,,,,,,,,,,,,,,,,,,,,,,,,,,,,,,,,,,,,,,,,,,,,,,,,,,,,,,,,,,,,,,,,,,,,,,,,,,,,,,,,,,,,,,,,,,,,,,,���̔��B,1,0,2,,,,,,,,,,,,,,,,,,,,,,
1009,visit1_arm_1,,,0,58,1,1,1,1,1,1,1,1,0,0,0,0,0,0,0,0,0,2,2,0,,,,,,,,,,,,,,,,,,,,,,,,,,,,,,,,,,,,,,,,,,,,,,,,,,,,,,,,,,,,,,,,,,,,,,,,,,,,,,,,,,,,,,,,,,,,,,,,,,,,,,,,,,,,,,,,,,,,,,,,,,,,,,,,,,,,,,,,,,,,,,,,,,,,,,,,,,,,,,,,,,,,,,,0,0,,,,,,,,,,,,,,,,,,,,
1009,visit2_arm_1,,,,,,,,,,,,,,,,,,,,,,,,,0,0,0,0,0,0,0,0,0,0,0,0,0,,2,0,0,,,8,3,0,0,0,0,0,0,0,0,2,1,2,0,,,1,16,0,,,,,,0,,1,2,144,91,61,6,2,23,0.16,,96,36,4,1,0,0,0,0,0,0,0,0,0,0,0,0,0,0,0,1,0,0,0,0,2,50.9,159.4,82,3,3,2,3,3,3,3,3,3,3,3,3,5,5,5,5,5,5,5,1,3,1,1,5,5,2,2,5,5,3,3,5,3,3,3,3,2,1,0,2,2,0,0,0,2,0,2,2,0,0,0,1,0,2,,,,,,,,,,,,,,,,,,,,,,,,,,,,,,,,387,53.9,0.02,1.29,0.356,4.466540005,3.575678174,48.16,48,95,100,72,52,81.25,100,100,85,0.05,6,5
1009,visit3_arm_1,,,,,,,,,,,,,,,,,,,,,,,,,,,,,,,,,,,,,,,,,,,,,,,,,,,,,,,,,,,,,,,,,,,,,,,,107,68,98,8,5,36,0.2,,127,74,6,1,0,0,0,0,0,0,0,0,0,0,0,0,0,0,0,0,0,0,0,0,2,,,,,,,,,,,,,,,,,,,,,,,,,,,,,,,,,,,,,,,,,1,0,1,3,3,0,3,2,3,0,3,2,0,2,1,2,2,0,0,0,0,0,1,,,,,0,2,5,2,1,0,0,0,0,0,0,0,0,0,2,,,,,,,,,,,,5.75448148,4.601518647,93.2,93,,,,,,,,,0,15,10
1009,visit4_arm_1,,,,,,,,,,,,,,,,,,,,,,,,,,,,,,,,,,,,,,,,,,,,,,,,,,,,,,,,,,,,,,,,,,,,,,,,88,52,90,5,5,28,0.31,,121,66,34,1,0,0,0,0,0,0,0,0,0,0,0,0,0,0,0,1,0,0,0,0,2,51.2,159.2,83.5,4,3,2,3,3,3,3,3,3,3,3,3,5,5,4,5,5,5,5,1,3,1,2,5,5,2,2,5,5,2,3,5,3,3,3,3,2,1,0,1,0,3,0,3,3,0,1,0,2,0,2,2,0,2,0,0,0,0,0,1,,,,,1,2,35,2,1,0,0,0,0,0,0,0,0,0,2,,,,,,,359,47,0.262,2.1,0.33,5.134840258,4.270252412,110.31,110,95,93.75,72,45,75,100,100,90,0.05,10,7
1009,visit5_arm_1,,,,,,,,,,,,,,,,,,,,,,,,,,,,,,,,,,,,,,,,,,,,,,,,,,,,,,,,,,,,,,,,,,,,,,,,116,68,77,10,10,34,0.42,,121,65,10,1,0,0,0,0,0,0,0,0,0,0,0,0,0,0,0,0,1,0,0,0,2,,,,,,,,,,,,,,,,,,,,,,,,,,,,,,,,,,,,,,,,,1,0,2,3,3,1,3,2,1,2,3,3,1,3,2,1,2,0,0,0,0,0,1,,,,,0,2,,,1,0,0,0,0,0,0,0,0,0,2,,,,,,,,,,,,6.034765602,5.11983034,95.42,95,,,,,,,,,0.05,15,15
1010,visit1_arm_1,,,0,65,1,1,1,1,1,1,1,1,0,0,0,0,0,0,0,0,0,2,2,0,,,,,,,,,,,,,,,,,,,,,,,,,,,,,,,,,,,,,,,,,,,,,,,,,,,,,,,,,,,,,,,,,,,,,,,,,,,,,,,,,,,,,,,,,,,,,,,,,,,,,,,,,,,,,,,,,,,,,,,,,,,,,,,,,,,,,,,,,,,,,,,,,,,,,,,,,,,,,,,,,,,,,,,0,0,,,,,,,,,,,,,,,,,,,,
1010,visit2_arm_1,,,,,,,,,,,,,,,,,,,,,,,,,1,0,0,0,1,0,0,0,0,0,0,0,0,,2,0,1,4,60,7,3,0,0,0,0,0,0,0,0,3,2,2,0,,,1,6,0,,,,,,1,9,1,2,124,70,53,10,0,15,0.01,,33,35,6,1,0,0,1,1,0,0,2,1,1,0,1,1,1,0,0,1,0,0,0,1,2,52,145.8,84.2,4,3,1,2,2,2,2,2,1,2,3,3,3,3,3,3,4,5,5,3,4,2,2,5,5,2,3,5,3,1,3,4,3,3,2,4,2,1,0,1,1,0,0,0,0,0,1,1,0,0,0,0,0,2,,,,,,,,,,,,,,,,,,,,,,,,,,,,,,,,18.5,46.5,0.02,0.554,0.236,4.15651063,3.255187154,51.01,51,50,50,51,35,56.25,62.5,91.66666667,95,0.55,2,2
1010,visit3_arm_1,,,,,,,,,,,,,,,,,,,,,,,,,,,,,,,,,,,,,,,,,,,,,,,,,,,,,,,,,,,,,,,,,,,,,,,,121,70,69,7,3,20,0.03,,33,19,8,1,0,0,1,0,0,0,0,0,1,0,1,1,1,0,0,1,0,0,0,1,2,,,,,,,,,,,,,,,,,,,,,,,,,,,,,,,,,,,,,,,,,1,0,1,0,0,0,0,0,0,0,0,0,0,0,0,0,2,1,0,0,0,0,0,,,,,,2,30,2,1,0,0,0,0,0,0,0,0,0,2,,,,,,,,,,,,4.329607552,3.287046096,37.03,37,,,,,,,,,0.35,1,0
1010,visit4_arm_1,,,,,,,,,,,,,,,,,,,,,,,,,,,,,,,,,,,,,,,,,,,,,,,,,,,,,,,,,,,,,,,,,,,,,,,,132,70,71,6,6,11,0.01,,35,28,15,1,0,0,1,0,0,0,1,0,2,0,1,1,1,0,0,1,0,0,0,1,2,53.4,146,85,3,2,1,2,2,1,1,2,1,2,3,3,3,4,4,5,4,4,4,2,3,2,3,5,5,2,3,5,5,2,4,4,3,4,3,4,2,1,0,1,0,0,0,0,0,0,1,0,0,0,0,0,0,2,1,0,0,0,0,0,,,,,,2,36,2,1,0,0,0,0,0,0,0,0,0,2,,,,,,,50.2,55.3,0.02,0.485,0.185,4.128098075,3.443883049,55.01,55,40,75,62,42,68.75,75,75,90,0.45,1,1
1010,visit5_arm_1,,,,,,,,,,,,,,,,,,,,,,,,,,,,,,,,,,,,,,,,,,,,,,,,,,,,,,,,,,,,,,,,,,,,,,,,130,71,72,12,8,14,0.01,,32,19,17,1,0,0,1,0,0,0,1,0,1,0,1,0,1,0,0,1,0,0,0,1,2,,,,,,,,,,,,,,,,,,,,,,,,,,,,,,,,,,,,,,,,,1,0,3,1,0,0,0,0,0,2,1,0,0,0,0,0,2,1,0,0,0,0,0,,,,,,2,,,1,0,0,0,0,0,0,0,0,0,2,,,,,,,,,,,,4.84519663,3.992168164,56.01,56,,,,,,,,,0.35,4,3
1011,visit1_arm_1,,,0,66,1,1,1,1,1,1,1,1,0,0,0,0,0,0,0,0,0,2,2,0,,,,,,,,,,,,,,,,,,,,,,,,,,,,,,,,,,,,,,,,,,,,,,,,,,,,,,,,,,,,,,,,,,,,,,,,,,,,,,,,,,,,,,,,,,,,,,,,,,,,,,,,,,,,,,,,,,,,,,,,,,,,,,,,,,,,,,,,,,,,,,,,,,,,,,,,,,,,,,,,,,,,,,,0,0,,,,,,,,,,,,,,,,,,,,
1011,visit2_arm_1,,,,,,,,,,,,,,,,,,,,,,,,,1,0,0,0,1,0,0,0,0,0,0,0,0,,3,0,0,,,7,3,0,0,0,0,0,0,0,0,3,2,2,0,,,1,6,0,,,,,,1,2,1,2,112,74,72,6,0,48,0.02,,126,31,9,1,1,0,1,1,1,0,1,0,0,0,0,0,1,0,1,1,1,0,0,0,2,55.6,168.5,86.9,3,2,1,2,1,3,3,3,1,2,2,3,2,2,2,2,3,3,3,1,4,2,4,4,5,2,5,5,4,3,3,5,3,4,3,4,2,1,1,1,0,0,0,0,0,0,0,0,0,0,0,0,0,2,,,,,,,,,,,,,,,,,,,,,,,,,,,,,,,,115,38.9,0.47,0.793,0.68,4.515554964,2.831350016,46.02,46,55,25,51,42,37.5,100,50,80,0.45,1,0
1011,visit3_arm_1,,,,,,,,,,,,,,,,,,,,,,,,,,,,,,,,,,,,,,,,,,,,,,,,,,,,,,,,,,,,,,,,,,,,,,,,120,79,93,8,0,54,0.02,,180,54,31,1,1,0,0,1,1,0,1,0,0,0,0,0,1,0,0,1,1,0,0,0,2,,,,,,,,,,,,,,,,,,,,,,,,,,,,,,,,,,,,,,,,,1,1,1,0,0,2,0,0,2,1,0,0,1,0,0,1,2,1,0,0,0,0,0,,,,,,2,30,2,0,0,0,0,0,0,1,0,0,0,2,,,,,,,,,,,,5.132208022,3.36555495,93.02,93,,,,,,,,,0.35,5,3
1011,visit4_arm_1,,,,,,,,,,,,,,,,,,,,,,,,,,,,,,,,,,,,,,,,,,,,,,,,,,,,,,,,,,,,,,,,,,,,,,,,123,80,80,11,4,57,0.07,,273,56,10,1,1,0,1,1,1,1,1,0,0,0,0,0,1,0,1,1,1,0,0,0,2,57.7,169.2,88,4,4,2,2,2,2,2,3,2,2,2,2,1,3,3,3,3,3,3,2,5,4,5,4,5,4,5,4,3,5,2,3,3,4,2,4,2,1,1,2,3,3,3,3,0,1,2,2,2,3,2,0,1,2,1,0,0,0,0,0,,,,,,2,,,,0,0,0,0,0,0,0,0,0,0,,,,,,,717,109.6,1.71,7.54,0.738,6.03144577,4.352336053,81.07,81,55,37.5,22,30,18.75,62.5,50,55,0.5,15,12
1011,visit5_arm_1,,,,,,,,,,,,,,,,,,,,,,,,,,,,,,,,,,,,,,,,,,,,,,,,,,,,,,,,,,,,,,,,,,,,,,,,101,69,90,10,7,55,0.06,,373,51,7,1,1,0,1,1,1,1,1,0,0,0,0,0,1,0,1,1,1,0,0,0,2,,,,,,,,,,,,,,,,,,,,,,,,,,,,,,,,,,,,,,,,,1,1,3,0,3,1,3,0,0,3,0,2,1,2,0,0,2,0,0,1,0,1,0,8,,,10,,2,,,,0,0,0,0,0,0,0,0,0,0,,,,,,,,,,,,6.030819086,4.354887163,75.06,75,,,,,,,,,0.5,10,8
1011,ae_arm_1,ae,1,,,,,,,,,,,,,,,,,,,,,,,,,,,,,,,,,,,,,,,,,,,,,,,,,,,,,,,,,,,,,,,,,,,,,,,,,,,,,,,,,,,,,,,,,,,,,,,,,,,,,,,,,,,,,,,,,,,,,,,,,,,,,,,,,,,,,,,,,,,,,,,,,,,,,,,,,,,,,,,,,,,,,,,,,,,,,,,,,,,,,,,,,��],3,0,2,,,,,,,,,,,,,,,,,,,,,,
1011,ds_arm_1,,,,,,,,,,,,,,,,,,,,,,,,,,,,,,,,,,,,,,,,,,,,,,,,,,,,,,,,,,,,,,,,,,,,,,,,,,,,,,,,,,,,,,,,,,,,,,,,,,,,,,,,,,,,,,,,,,,,,,,,,,,,,,,,,,,,,,,,,,,,,,,,,,,,,,,,,,,,,,,,,,,,,,,,,,,,,,30,2,0,0,0,0,0,0,1,0,0,0,2,,,,,,,,,,,,,,,,,,,,,,,,,,
1012,visit1_arm_1,,,0,60,1,1,1,1,1,1,1,1,0,0,0,0,0,0,0,0,0,2,2,0,,,,,,,,,,,,,,,,,,,,,,,,,,,,,,,,,,,,,,,,,,,,,,,,,,,,,,,,,,,,,,,,,,,,,,,,,,,,,,,,,,,,,,,,,,,,,,,,,,,,,,,,,,,,,,,,,,,,,,,,,,,,,,,,,,,,,,,,,,,,,,,,,,,,,,,,,,,,,,,,,,,,,,,0,0,,,,,,,,,,,,,,,,,,,,
1012,visit2_arm_1,,,,,,,,,,,,,,,,,,,,,,,,,1,1,0,0,1,0,0,0,0,0,0,0,0,,3,0,1,3,30,6.5,3,1,0,0,0,0,0,0,1,4,3,2,0,,,1,12,1,1,,1000mg,4,50mg,1,4,0,2,138,90,66,3,4,11,0.12,,19,39,20,1,0,0,0,0,1,0,0,0,1,0,0,0,0,0,0,1,1,0,0,1,2,69.2,163.8,111.4,3,3,1,3,3,2,3,2,2,3,3,3,3,3,3,4,5,5,4,1,2,2,2,4,5,2,4,5,5,4,4,4,3,4,3,3,2,1,0,2,1,0,0,1,0,0,2,1,0,0,1,0,0,2,,,,,,,,,,,,,,,,,,,,,,,,,,,,,,,,1100,33.1,7.25,0.672,0.297,3.754475143,3.319793102,66.12,66,75,56.25,74,47,68.75,87.5,91.66666667,75,0.25,4,4
1012,visit3_arm_1,,,,,,,,,,,,,,,,,,,,,,,,,,,,,,,,,,,,,,,,,,,,,,,,,,,,,,,,,,,,,,,,,,,,,,,,136,84,66,1,2,10,0.03,,20,34,5,1,0,0,0,0,1,0,1,0,1,0,0,0,1,0,0,1,1,0,0,1,2,,,,,,,,,,,,,,,,,,,,,,,,,,,,,,,,,,,,,,,,,1,0,2,0,0,0,1,0,0,2,0,0,0,0,0,0,2,1,0,0,0,0,0,,,,,,2,90,2,1,0,0,0,0,0,0,0,0,0,2,,,,,,,,,,,,3.043789363,2.486430933,42.03,42,,,,,,,,,0.35,3,2